RDF description of 販売数量_1
primary topic: 販売数量_1

販売数量_1
type: TerminologyConcept
in scheme: TerminologyConceptScheme
top concept of: TerminologyConceptScheme
broader: Ta00473
created: 2017-12-01
description: 販売量を数量の単位（cmプライ、kmコア、グロス、セクション数、セット、ダース、デカ、羽、箇所、回、階、階建、換算箱、企業、基、機、教室、経営体、件、個、講座、施設、事業所、式、室、社、隻、組、足、体、台、挺、点、頭、鉢、発、本、枚、面、門、両など）で表したもの。販売とは、販売業者又は消費者である他企業に直接販売したもの、販売することを目的として本社・営業所又は中継所等（これが契約の主体となって借り受けている倉庫などを含む。）に出荷したもの、受託生産品を販売業者である委託者へ出荷したもの、同一調査品目を生産していない同一企業内の他工場へ出荷したもの（全くの転売品）のことである。ただし、返品があった場合はその数量を差し引く。