販売重量
type: TerminologyConcept
description: 販売量を重量の単位（g、kg、t、鉛量t、純分換算kg、絶乾t、導体tなど）で表したもの。販売とは、販売業者又は消費者である他企業に直接販売したもの、販売することを目的として本社・営業所又は中継所等（これが契約の主体となって借り受けている倉庫などを含む。）に出荷したもの、受託生産品を販売業者である委託者へ出荷したもの、同一調査品目を生産していない同一企業内の他工場へ出荷したもの（全くの転売品）のことである。ただし、返品があった場合はその数量を差し引く。
created: 2017-12-01
broader: Ta00288
top concept of: TerminologyConceptScheme
in scheme: TerminologyConceptScheme

RDF description of 販売重量
primary topic: 販売重量