販売費・一般管理費
type: TerminologyConcept
description: 商品・製品・サービスの販売業務や一般管理業務に関して発生した費用の額。販売手数料、荷造費、運搬費、広告宣伝費、保管費、販売費及び一般管理業務に従事する従業者の給料、賃金、手当、賞与、福利厚生費、販売費及び一般管理部門関係の交際費、交通費、通信費、光熱費、消耗品費、租税公課、減価償却費、修繕費、保険料、不動産賃借料等の合計額。電気・ガス業においては、収入課税の事業税を含める。
created: 2017-12-01
broader: Ta00089
top concept of: TerminologyConceptScheme
in scheme: TerminologyConceptScheme

RDF description of 販売費・一般管理費
primary topic: 販売費・一般管理費