搬出日
type: TerminologyConcept
description: 船舶によって運ばれた貨物（輸入又は移入）が港湾において船卸しされ、調査区域から内陸（仕向地）へ輸送される日。
created: 2017-12-01
broader: Ta00331
top concept of: TerminologyConceptScheme
in scheme: TerminologyConceptScheme

RDF description of 搬出日
primary topic: 搬出日