売掛未収入金の種類
type: TerminologyConcept
description: 売掛未収入金の種類。売掛未収入金とは、生産物を販売契約して現物を相手に渡したが、その代金を未だ受領していない場合の未収入金をいう。
created: 2017-12-01
broader: Ta00564
top concept of: TerminologyConceptScheme
in scheme: TerminologyConceptScheme

RDF description of 売掛未収入金の種類
primary topic: 売掛未収入金の種類