配偶の関係_2
type: TerminologyConcept
description: 個人の戸籍上の配偶者の有無及び配偶者がいない場合の未婚、死別、離別の別。内縁のものは含まれない。
created: 2017-12-01
broader: Ta00502
top concept of: TerminologyConceptScheme
in scheme: TerminologyConceptScheme

RDF description of 配偶の関係_2
primary topic: 配偶の関係_2