排気量
type: TerminologyConcept
narrower: si327010115
narrower: si327020113
top concept of: TerminologyConceptScheme
narrower: si327010111
narrower: si327020108
created: 2017-12-01
description: 自動車、自動二輪車及び原動機付自転車の総排気量。排気量とは、混合気をシリンダ内の上死点から下死点の間で吸い込むことができる容積である。総排気量は、（円周率）×（シリンダ内径/２）の２乗×（ピストンストローク量）×（気筒数）で表される。
broader: Ta00235
in scheme: TerminologyConceptScheme

RDF description of 排気量
primary topic: 排気量