派遣受入者数_2
type: TerminologyConcept
narrower: si409020020
broader: Ta00116
created: 2017-12-01
narrower: si457010022
narrower: si457010021
narrower: si408020019
narrower: si409020019
description: 労働派遣法でいう派遣労働者として、調査対象である事業所に来て働いている者の数。なお、別経営の事業所から業務請負により調査対象である事業所の一区画で働いている者は、含まない。
top concept of: TerminologyConceptScheme
in scheme: TerminologyConceptScheme
narrower: si408020020

RDF description of 派遣受入者数_2
primary topic: 派遣受入者数_2