RDF description of 農業生産資材の品名
primary topic: 農業生産資材の品名

農業生産資材の品名
type: TerminologyConcept
in scheme: TerminologyConceptScheme
top concept of: TerminologyConceptScheme
broader: Ta00601
created: 2017-12-01
description: 農業生産資材の品名。種子・苗木・蚕種、肥料、飼料、農業薬剤、諸材料、光熱動力等の生産財の費目。