RDF description of 農業生産資材の費目
primary topic: 農業生産資材の費目

農業生産資材の費目
type: TerminologyConcept
in scheme: TerminologyConceptScheme
top concept of: TerminologyConceptScheme
broader: Ta00601
created: 2017-12-01
description: 農業生産資材の費目。種苗・苗木、肥料、飼料、農業薬剤、諸材料、光熱動力、包装荷造・運搬等料金のうち、いずれか。