RDF description of 農業準主業世帯数
primary topic: 農業準主業世帯数

農業準主業世帯数
type: TerminologyConcept
in scheme: TerminologyConceptScheme
top concept of: TerminologyConceptScheme
broader: Ta00392
created: 2017-12-01
description: 準主業農家である世帯の数。準主業農家とは、農外所得が主で65歳未満農業就業者がいる世帯をいう。