農業公園数
type: TerminologyConcept
description: 農業公園の数。農業公園とは、農業振興を図る交流拠点として、生産・普及・展示機能、農業体験機能、レジャー・レクリエーション機能等を有し、農業への理解の増進や人材の確保育成を図るための公園をいう。なお、国や地方自治体のほか、民間、第３セクター等が管理・運営しているものを含む。
created: 2017-12-01
broader: Ta00407
top concept of: TerminologyConceptScheme
in scheme: TerminologyConceptScheme

RDF description of 農業公園数
primary topic: 農業公園数