RDF description of 農家の関与者区分
primary topic: 農家の関与者区分

農家の関与者区分
type: TerminologyConcept
in scheme: TerminologyConceptScheme
top concept of: TerminologyConceptScheme
broader: Ta00527
created: 2017-12-01
description: 農家の関与者か否かの別。関与者とは、経営主夫婦、その扶養家及び年間の労働日数が６０日以上のの世帯員をいう。