年金制度が組み込まれている貯蓄の現在高
type: TerminologyConcept
description: 将来的に定められた額を受け取る制度がある貯蓄（財形年金貯蓄、個人年金信託、個人年金保険、簡易保険のうちの年金商品など）の額。公的年金（厚生年金、国民年金及び共済年金）や企業年金（適格退職年金、国民年金基金、厚生年金基金など）は含めない。
created: 2017-12-01
broader: Ta00004
in scheme: TerminologyConceptScheme
narrower: si328010055
narrower: si245020022
narrower: si328020055
narrower: si245010022
top concept of: TerminologyConceptScheme

RDF description of 年金制度が組み込まれている貯蓄の現在高
primary topic: 年金制度が組み込まれている貯蓄の現在高