RDF description of 入居時期
primary topic: 入居時期

入居時期
type: TerminologyConcept
in scheme: TerminologyConceptScheme
top concept of: TerminologyConceptScheme
narrower: si329010028
narrower: si329020033
broader: Ta00337
created: 2017-12-01
description: 住宅に実際に入居した時期。世帯の家計を主に支える人が出生時から引き続き住んでいる場合は、その人の出生時を入居時期とする。現在の住居が入居後に建て替えられた住居である場合には、建て替え以前の住居に入居した時期とする。単身赴任などで一時的に住居を離れたことがある場合でも、最初に入居した時期とする。家の一部を改造するため、改造が終わるまでしばらくの間、他の住宅に住んでいた場合、改造前の住宅に入居した時期とする。各世帯員の入居時期が一定でない場合には、世帯の家計を主に支える人が入居した時期とする。ただし、夫の住んでいた住宅に妻が後から入居し、その後夫が単身赴任などでその住居を離れた場合、妻が入居した時期を入居時期とする。