RDF description of 入学料・検定料収入額
primary topic: 入学料・検定料収入額

入学料・検定料収入額
type: TerminologyConcept
description: 調査実施年度の前会計年度に納入された、その学校の入学金、検定料（入学試験料）の額。
created: 2017-12-01
broader: Ta00068
in scheme: TerminologyConceptScheme
top concept of: TerminologyConceptScheme