RDF description of 特別積合せ貨物重量
primary topic: 特別積合せ貨物重量

特別積合せ貨物重量
type: TerminologyConcept
in scheme: TerminologyConceptScheme
top concept of: TerminologyConceptScheme
broader: Ta00278
created: 2017-12-01
description: 特別積合せ貨物運送による、宅配便貨物を除いた特別積合せ貨物の重量。特別積合せ貨物運送とは、一般貨物自動車運送事業として行う運送のうち、営業所その他の事業場において集貨された貨物の仕分を行い、集貨された貨物を積み合わせて他の事業場に運送し、当該他の事業場において運送された貨物の配達に必要な仕分を行うものであって、これらの事業場の間における当該積合せ貨物の運送を定期的に行うものをいう。