特定集中治療室病床数
type: TerminologyConcept
description: 特定集中治療室管理を行うのにふさわしい専用の構造設備及び人員配置の基準が満たされている室の病床数。
created: 2017-12-01
broader: Ta00462
top concept of: TerminologyConceptScheme
in scheme: TerminologyConceptScheme

RDF description of 特定集中治療室病床数
primary topic: 特定集中治療室病床数