特許権数
type: TerminologyConcept
description: 開発如何に関わらず、登録料を継続的に支払っている特許権（発明を独占的に利用し得る権利であり、特許法による登録をしたもの）の件数。
created: 2017-12-01
broader: Ta00457
top concept of: TerminologyConceptScheme
in scheme: TerminologyConceptScheme

RDF description of 特許権数
primary topic: 特許権数