積立金の額
type: TerminologyConcept
description: 会社が利益を処分する際、株主総会の決議などに基づいて任意に設定された利益準備金以外の剰余金の額。減債積立金、別途積立金、中間配当積立金、配当平均積立金、事業拡張積立金、偶発損失積立金、自家保険積立金、租税特別措置法に基づく価格変動準備金、海外市場開拓準備金、債権償却特別勘定等。
created: 2017-12-01
broader: Ta00043
top concept of: TerminologyConceptScheme
in scheme: TerminologyConceptScheme

RDF description of 積立金の額
primary topic: 積立金の額