投餌量
type: TerminologyConcept
description: 海面養殖業を営むために投与した餌料の数量とする。ただし、種苗養殖のみのために投与した餌料は含めない。
created: 2017-12-01
broader: Ta00272
in scheme: TerminologyConceptScheme
top concept of: TerminologyConceptScheme

RDF description of 投餌量
primary topic: 投餌量