RDF description of 土地台帳面積・総面積
primary topic: 土地台帳面積・総面積

土地台帳面積・総面積
type: TerminologyConcept
in scheme: TerminologyConceptScheme
top concept of: TerminologyConceptScheme
broader: Ta00201
created: 2017-12-01
description: 作付地については土地台帳面積、作付地以外については総面積のことである。土地台帳面積とは、旧土地台帳、土地登記簿、固定資産課税台帳、基盤整備事業等の資料をもとにした面積及び国土基本図、都市計画図、森林基本図等、空中写真などをもとに求積した面積であり、総面積とは、建物及び敷地の面積である。