田の団地数
type: TerminologyConcept
description: 田の経営耕地のうち、作業単位としている田の団地の数。田の団地とは、地続きの耕地の一団であって、その耕地に田を含む団地をいう。ただし、地続きの経営耕地の一団が、他人の経営する耕地又は間地等によって分割されていても、作業単位として分離されていない場合は同一団地として取り扱う。
created: 2017-12-01
broader: Ta00437
in scheme: TerminologyConceptScheme
top concept of: TerminologyConceptScheme

RDF description of 田の団地数
primary topic: 田の団地数