転炉の鉄皮全内容積
type: TerminologyConcept
description: 転炉の鉄皮全内容積。転炉とは、高炉で得られた銑鉄から炭素を徹底的に減らし、溶銑予備処理でとりきれなかったりん、硫黄、けい素など不純物を除去するための炉のことである。
created: 2017-12-01
broader: Ta00253
top concept of: TerminologyConceptScheme
in scheme: TerminologyConceptScheme

RDF description of 転炉の鉄皮全内容積
primary topic: 転炉の鉄皮全内容積