転送体積量_2
type: TerminologyConcept
description: 転送量を体積の単位（l、kl、m3、Nm3など）で表したもの。転送量とは、原油等を自社の他製油所等へ払い出した数量。
created: 2017-12-01
broader: Ta00248
top concept of: TerminologyConceptScheme
in scheme: TerminologyConceptScheme

RDF description of 転送体積量_2
primary topic: 転送体積量_2