RDF description of 転送重量
primary topic: 転送重量

転送重量
type: TerminologyConcept
in scheme: TerminologyConceptScheme
top concept of: TerminologyConceptScheme
broader: Ta00294
created: 2017-12-01
description: 転送量を重量の単位（g、kg、t、鉛量t、純分換算kg、絶乾t、導体tなど）で表したもの。転送量とは、原油等を自社の他製油所等へ払い出した数量。