提携クレジットカード発行枚数
type: TerminologyConcept
description: 自社において発行している提携カード（他のクレジットカード会社や商業企業等と提携したもの）の発行枚数。
created: 2017-12-01
broader: Ta00463
top concept of: TerminologyConceptScheme
in scheme: TerminologyConceptScheme

RDF description of 提携クレジットカード発行枚数
primary topic: 提携クレジットカード発行枚数