定時制（本科）の昼夜の別
type: TerminologyConcept
description: 高等学校又は中等教育学校（後期課程）における定時制（本科）の独立校又は併置校の課程の昼夜の別。昼、夜、昼夜併置、昼夜、その他に区分される。
created: 2017-12-01
broader: Ta00514
top concept of: TerminologyConceptScheme
in scheme: TerminologyConceptScheme

RDF description of 定時制（本科）の昼夜の別
primary topic: 定時制（本科）の昼夜の別