定期預金・定期積金の有無
type: TerminologyConcept
narrower: si245020005
narrower: si245010005
description: 預金のうち定期性預金の有無。定期性預金とは、積立定期預金、期日指定定期預金、スーパー定期、変動金利定期預金、定期積金、外貨定期預金などを指す。積立定期預金とは、一定期間ごとに普通預金から一定額を振り替えて定期預金として積み立て、満期時には一口の定期預金にまとめられる預金。期日指定定期預金とは、一定期間を経過すれば最長預入期限までの間で自由に満期日を指定でき、一部払戻しも可能である預金。スーパー定期とは、満期期間があらかじめ設定されている定型方式又は満期日を１か月から10年未満の範囲内で預金者が指定する満期日指定方式による定期預金。変動金利定期預金とは、長期金利に連動して一定期間（主に６か月）ごとに金利が変更される定期預金。定期積金とは、一定期間ごとに一定額を積み立て、満期日に掛金に給付補てん金（利息）を加えた給付金が支払われる定期預金。スーパー積金など。外貨定期預金とは、日本円以外の通貨による定期預金。
in scheme: TerminologyConceptScheme
broader: Ta00557
top concept of: TerminologyConceptScheme
created: 2017-12-01

RDF description of 定期預金・定期積金の有無
primary topic: 定期預金・定期積金の有無