通常貯金の現在高
type: TerminologyConcept
created: 2017-12-01
narrower: si245020004
top concept of: TerminologyConceptScheme
broader: Ta00004
narrower: si245010004
narrower: si328020045
description: 通常貯金、通常貯蓄貯金などの額。通常貯金とは、預入れ、払戻しが自由にでき、公共料金や代金等の自動振込や給与・配当金等の自動受取を利用できる貯金。通常貯蓄貯金とは、10万円の基準額を設け、貯金残高が基準額以上であれば、通常貯金よりも高い金利が付与される貯金。預入れ、払戻しは自由にできるが、公共料金等の自動振込、給与・配当金等の自動受取の口座として利用することはできない。
in scheme: TerminologyConceptScheme
narrower: si328010045

RDF description of 通常貯金の現在高
primary topic: 通常貯金の現在高