通院の有無
type: TerminologyConcept
description: 現在、傷病（病気やけが）で病院や診療所（医院、歯科医院）、あんま・はり・きゅう・柔道整復師（施術所）に通院・通所しているか否か。なお、調査日に通院・通所していなくても、ここ１か月ぐらい通院・通所を継続している場合は「1通っている」に含む。
created: 2017-12-01
broader: Ta00627
in scheme: TerminologyConceptScheme
top concept of: TerminologyConceptScheme

RDF description of 通院の有無
primary topic: 通院の有無