RDF description of 賃借料額
primary topic: 賃借料額

賃借料額
type: TerminologyConcept
in scheme: TerminologyConceptScheme
top concept of: TerminologyConceptScheme
broader: Ta00082
created: 2017-12-01
description: 賃貸借契約に基づいて、賃借の対価として支払う経費の額。賃貸借契約とは、当事者の一方が相手方に物の使用収益をさせ、これに対して相手方が賃料を支払う契約を指す。対象には土地・建物等の不動産、機械・装置等の動産、著作権等の権利などが含まれる。リース契約による支払いリース料を含む。端末機を含むコンピュータの賃借料は含まない。