賃加工品の品目_2
type: TerminologyConcept
description: 賃加工品の品目（品物の種類別の項目）。賃加工品とは、賃加工による生産品である。賃加工とは、有償、無償にかかわらず、所有権の無い原材料や製品の加工によって加工賃を受け取るものをいい、自己所有の原材料や製品を加工するものは除く。
created: 2017-12-01
broader: Ta00583
in scheme: TerminologyConceptScheme
top concept of: TerminologyConceptScheme

RDF description of 賃加工品の品目_2
primary topic: 賃加工品の品目_2