RDF description of 直接輸出額
primary topic: 直接輸出額

直接輸出額
type: TerminologyConcept
description: 自社（自己）名義で通関手続きを行って国内から商品を出荷した場合の輸出額。外国にある自企業の支店へ商品を出荷した場合を含む。貿易商社等他の企業に依頼し、その業者の名で通関手続きを取った場合は除く。
created: 2017-12-01
broader: Ta00053
in scheme: TerminologyConceptScheme
top concept of: TerminologyConceptScheme