直接死因の原因の原因
type: TerminologyConcept
description: 直接死因となった一連の病態とは別に、死亡の原因に影響を及ぼした疾病（病気やけが）の名称。
created: 2017-12-01
broader: Ta00627
in scheme: TerminologyConceptScheme
top concept of: TerminologyConceptScheme

RDF description of 直接死因の原因の原因
primary topic: 直接死因の原因の原因