RDF description of 長期借入金の額
primary topic: 長期借入金の額

長期借入金の額
type: TerminologyConcept
description: 銀行、取引先などからの借入金のうち、借入期間が決算日の翌日から起算して１年を超える負債又は正常営業循環基準にない借入金の額。株主、役員、従業員からの借入金は含まない。
created: 2017-12-01
broader: Ta00048
in scheme: TerminologyConceptScheme
top concept of: TerminologyConceptScheme