RDF description of 調整手当額
primary topic: 調整手当額

調整手当額
type: TerminologyConcept
in scheme: TerminologyConceptScheme
top concept of: TerminologyConceptScheme
broader: Ta00087
created: 2017-12-01
description: 平成１５年４月分として当該地方公共団体の条例に基づき支給されるべき調整手当の月額。