RDF description of 貯蓄の現在高
primary topic: 貯蓄の現在高

貯蓄の現在高
type: TerminologyConcept
in scheme: TerminologyConceptScheme
top concept of: TerminologyConceptScheme
narrower: si245010020
narrower: si245020020
narrower: si328010054
narrower: si328020054
broader: Ta00004
created: 2017-12-01
description: 郵便局、銀行、信託銀行、信用金庫、農業協同組合などの金融機関への預貯金、生命保険、個人年金保険、損害保険、簡易保険のこれまでに払い込んだ保険料、株式、株式投資信託、債券、公社債投資信託、金銭信託・貸付信託などの有価証券等の保有額、その他の預貯金（財形貯蓄、社内預貯金等）の世帯員全員の合計額。株式などの有価証券は時価に換算した額。掛け捨ての生命保険・損害保険、企業年金・厚生年金及び共済年金の掛金、たんす預金、貸金は含まない。自営業者世帯の場合は、事業用の貯蓄を含む。