中小動物の種類
type: TerminologyConcept
description: 中小動物の用途及び種類別に、肥育用豚、繁殖用豚、種付用豚、採卵用鶏、ブロイラー用鶏等に区分し、それ以外のものは、肥育用その他と肥育用以外のその他とする。
created: 2017-12-01
broader: Ta00596
in scheme: TerminologyConceptScheme
top concept of: TerminologyConceptScheme

RDF description of 中小動物の種類
primary topic: 中小動物の種類