RDF description of 地方選定漁業種類
primary topic: 地方選定漁業種類

地方選定漁業種類
type: TerminologyConcept
description: 漁業経営体が過去１年間に営んでいる地方選定漁業種類の名称。地方選定漁業種類とは、漁業種類を都道府県別に独自に細分化したものをいう。
created: 2017-12-01
broader: Ta00612
in scheme: TerminologyConceptScheme
top concept of: TerminologyConceptScheme