RDF description of 地方公共団体の団体区分
primary topic: 地方公共団体の団体区分

地方公共団体の団体区分
type: TerminologyConcept
description: 地方公共団体が都道府県、指定都市、市、町村、特別区、一部事務組合等のいずれであるかの別。
created: 2017-12-01
broader: Ta00572
in scheme: TerminologyConceptScheme
top concept of: TerminologyConceptScheme