単身赴任者・出稼ぎ者の有無
type: TerminologyConcept
description: 世帯が住んでいる住居を３か月以上（その見込みを含む。）離れている単身赴任者又は出稼ぎ者の有無及び単身赴任者又は出稼ぎ者がいる場合の世帯主（世帯を主宰する者）から見た続き柄。単身赴任者とは、配偶者又は扶養親族のある給与所得者で、会社などの命令により生活の本拠としていた住居を離れ、１人で生活している人をいう。出稼ぎ者とは、農家から農閑期に大都市圏に出て就労するなどのため、生活の本拠としていた住居を離れ、１人で生活している人をいう。
created: 2017-12-01
broader: Ta00552
top concept of: TerminologyConceptScheme
in scheme: TerminologyConceptScheme

RDF description of 単身赴任者・出稼ぎ者の有無
primary topic: 単身赴任者・出稼ぎ者の有無