単純X線撮影実施件数
type: TerminologyConcept
description: 特殊撮影及び造影剤使用撮影を含まない、Ｘ線写真撮影の単純撮影（間接撮影を含む）の実施件数。
created: 2017-12-01
broader: Ta00403
in scheme: TerminologyConceptScheme
top concept of: TerminologyConceptScheme

RDF description of 単純X線撮影実施件数
primary topic: 単純X線撮影実施件数