棚卸資産の資産額_2
type: TerminologyConcept
description: 販売又は消費を目的として一時的に保有している土地、建物、商品、製品、半製品、仕掛品、原材料、消耗品で貯蔵中のもの、その他これらに準ずるものの額。仕入価格（仕入先事業者が消費税を上乗せした価格）による評価額で、算定が困難な場合は時価。原材料を他の企業に支給して製造させた委託生産品は含め、下請け賃加工のために企業から支給された原材料及び加工済みの受託生産品は含めない。
created: 2017-12-01
broader: Ta00031
in scheme: TerminologyConceptScheme
top concept of: TerminologyConceptScheme

RDF description of 棚卸資産の資産額_2
primary topic: 棚卸資産の資産額_2