脱会した法人会員数
type: TerminologyConcept
description: 自社カードの法人会員数（契約数）のうち、直近１年間に法人会員契約を解除した法人会員数。
created: 2017-12-01
broader: Ta00145
top concept of: TerminologyConceptScheme
in scheme: TerminologyConceptScheme

RDF description of 脱会した法人会員数
primary topic: 脱会した法人会員数