RDF description of 宅配便貨物個数
primary topic: 宅配便貨物個数

宅配便貨物個数
type: TerminologyConcept
in scheme: TerminologyConceptScheme
top concept of: TerminologyConceptScheme
broader: Ta00464
created: 2017-12-01
description: 宅配便運賃として認可された輸送サービスの貨物について、特別積合せトラックが輸送した最終到着営業所又は発荷所が所在する都道府県別の１日分の総個数。