宅配便貨物重量
type: TerminologyConcept
description: 宅配便運賃として認可された輸送サービスの貨物について、特別積合せトラックが輸送した宅配便貨物の最終到着営業所又は荷扱所が所在する都道府県別の１日分の総重量。
created: 2017-12-01
broader: Ta00278
top concept of: TerminologyConceptScheme
in scheme: TerminologyConceptScheme

RDF description of 宅配便貨物重量
primary topic: 宅配便貨物重量