RDF description of 大・中コード
primary topic: 大・中コード

大・中コード
type: TerminologyConcept
in scheme: TerminologyConceptScheme
top concept of: TerminologyConceptScheme
broader: Ta00549
created: 2017-12-01
description: 調査対象者の企業規模を指し、「大企業」、「中小企業」、「その他（官公署等）」に分類。