代替教員数
type: TerminologyConcept
description: 女子教職員の出産に際しての補助教職員の確保に関する法律第３条第１項又は第５条によって任用された教員及び公立の学校においては地方公務員の育児休業等に関する法律第６条第１項、国立、私立の学校においては育児休業、介護休業等育児又は家族介護を行う労働者の福祉に関する法律第22条によって任用された教員の人数。
created: 2017-12-01
broader: Ta00122
top concept of: TerminologyConceptScheme
in scheme: TerminologyConceptScheme

RDF description of 代替教員数
primary topic: 代替教員数