RDF description of 体験学習林利用者数
primary topic: 体験学習林利用者数

体験学習林利用者数
type: TerminologyConcept
in scheme: TerminologyConceptScheme
top concept of: TerminologyConceptScheme
broader: Ta00150
created: 2017-12-01
description: 体験学習林の利用者数。体験実習林とは、植林、下刈り等林業生産活動等の体験学習を行うことを目的として提供されている林業体験林、林業学習林等の森林をいい、国や地方自治体のほか、民間、第３セクター等が管理・運営しているものを含む。なお、大学、高等学校、小中学校等の学校林は、広く一般に提供されている場合のみ含む。また、森林・林業研修資料館に併設され、一体的に利用されているものは除く。